�敪1,�敪2,�J�Ó�,�J�n����,�I������,�C�x���g��,�J�Ïꏊ,�X�֔ԍ�,�Z��,�ܓx,�o�x,�d�b�ԍ�,�{�ݐ���,�{��URL,�S���ҏ���,�S���Җ�,�S���ғd�b�ԍ�,�S���ғ���,URL,������,�|�C���g,���e,���ʐE�̏o�ȏ��,�Y�t���ނ̗L��,�񓹘A���p����o��
���J(�z�[���y�[�W�ɕ\������),���̑�,2023�N8��1��,8:30,9:00,�ÎR�s�n�您�������͑��Ϗ����t��,�ÎR�s����3�K���c��(�R�k),708-8501,�ÎR�s�R�k520,35.069591,134.004579,0868-32-2021,,https://www.city.tsuyama.lg.jp/,�n��Â��萄�i��,����,0868-32-2032,2645,,,,,,,
���J(�z�[���y�[�W�ɕ\������),���̑�,2023�N8��1��,8:30,17:15,�u��\�΂��j����vWeb�A���P�[�g,,,,,,,,,������琬��,���J,868322009,2472,https://www.city.tsuyama.lg.jp/life/index2.php?id=9030,,,,,,
���J(�z�[���y�[�W�ɕ\������),���̑�,2023�N8��1��,8:30,17:15,��37��ÎR�s�����a�� ���a�p�l���W,�ÎR�s�����P�K�s�����r�[(�R�k),708-8501,�ÎR�s�R�k520,35.069591,134.004579,0868-32-2021,,,�l���[����,,0868-31-0088,,,,,,,,
���J(�z�[���y�[�W�ɕ\������),���̑�,2023�N8��1��,9:30,11:30,���Z���E�����X�L���A�b�v���C��u�w�Z���u�b:���Z���E�����̖����v,�ÎR�s����2�K���c��(�R�k),708-8501,�ÎR�s�R�k520,35.069591,134.004579,0868-32-2021,,https://www.city.tsuyama.lg.jp/,�w�Z�����,�Ό�,0868-32-2116,2482,,,,,,,
���J(�z�[���y�[�W�ɕ\������),�Ղ�E�C�x���g,2023�N8��1��,10:00,11:30,�ÎR���y�����ىĂ̊w�K�v���O�����u���ʂ����낤�v*���ߐ؂�7��19��,�ÎR���y������(�R��),708-0022,�ÎR�s�R��92,35.060825,134.005657,0868-22-4567,,http://www.tsu-haku.jp/,�ÎR���y������,,0868-22-4567,,,,,,,,
���J(�z�[���y�[�W�ɕ\������),���N�E����,2023�N8��1��,12:50,13:30,1��6�J�������f,�ÎR�����₩�E���ǂ��Z���^�[(�R�k),708-0004,�ÎR�s�R�k800,35.069076,134.009127,0868-32-2179,,,���N���i��,,0868-32-2069,,https://www.city.tsuyama.lg.jp/life/index2.php?id=8226,,,,,,
���J(�z�[���y�[�W�ɕ\������),���̑�,2023�N8��2��,8:30,17:15,�u��\�΂��j����vWeb�A���P�[�g,,,,,,,,,������琬��,���J,868322009,2472,https://www.city.tsuyama.lg.jp/life/index2.php?id=9030,,,,,,
���J(�z�[���y�[�W�ɕ\������),���̑�,2023�N8��2��,8:30,17:15,��37��ÎR�s�����a�� ���a�p�l���W,�ÎR�s�����P�K�s�����r�[(�R�k),708-8501,�ÎR�s�R�k520,35.069591,134.004579,0868-32-2021,,,�l���[����,,0868-31-0088,,,,,,,,
���J(�z�[���y�[�W�ɕ\������),�Ղ�E�C�x���g,2023�N8��2��,9:00,12:00,�@���܂��Â��苦�c��u�ċx�݂킭�킭�����v,�@��������(�_��),,,,,,,,�@���܂��Â��苦�c�����,���c,0868-28-0335,,,,,,,,
���J(�z�[���y�[�W�ɕ\������),�Ղ�E�C�x���g,2023�N8��2��,10:00,11:30,�ÎR���y�����ىĂ̊w�K�v���O�����u���ʂ����낤�v*���ߐ؂�7��19��,�ÎR���y������(�R��),708-0022,�ÎR�s�R��92,35.060825,134.005657,0868-22-4567,,http://www.tsu-haku.jp/,�ÎR���y������,,0868-22-4567,,,,,,,,
���J(�z�[���y�[�W�ɕ\������),�Ղ�E�C�x���g,2023�N8��2��,10:30,11:00,�����Ȏq�ǂ��̂��ق�̂�����,�s���}����(�A���l�E�ÎR4�K),708-0065,�ÎR�s�V����17,35.05893,134.000516,0868-24-2919,,https://tsuyamalib.tvt.ne.jp/,�s���}����,,0868-24-2919,,https://tsuyamalib.tvt.ne.jp/event/tsuyama_kodomo.html#ehon,,,,,,
���J(�z�[���y�[�W�ɕ\������),�Ղ�E�C�x���g,2023�N8��2��,10:30,11:30,�ċx�݃X�y�V���� �����������*�\������7��20��10������,����������(�R�k),708-0004,�ÎR�s�R�k765,35.074105,134.009964,0868-22-2099,,,����������,,0868-22-2099,,,,,,,,
���J(�z�[���y�[�W�ɕ\������),���N�E����,2023�N8��2��,12:50,13:30,1��6�J�������f,�ÎR�����₩�E���ǂ��Z���^�[(�R�k),708-0004,�ÎR�s�R�k800,35.069076,134.009127,0868-32-2179,,,���N���i��,,0868-32-2069,,https://www.city.tsuyama.lg.jp/life/index2.php?id=8226,,,,,,
���J(�z�[���y�[�W�ɕ\������),���k,2023�N8��2��,13:30,15:30,�i�@���m�@�����k*�����E�\��v,�ÎR�s����1�K��������(�R�k),,,,,,,,��������,,0868-32-2057,,,,,,,,
���J(�z�[���y�[�W�ɕ\������),���̑�,2023�N8��3��,8:30,17:15,�u��\�΂��j����vWeb�A���P�[�g,,,,,,,,,������琬��,���J,868322009,2472,https://www.city.tsuyama.lg.jp/life/index2.php?id=9030,,,,,,
���J(�z�[���y�[�W�ɕ\������),���̑�,2023�N8��3��,8:30,17:15,��37��ÎR�s�����a�� ���a�p�l���W,�ÎR�s�����P�K�s�����r�[(�R�k),708-8501,�ÎR�s�R�k520,35.069591,134.004579,0868-32-2021,,,�l���[����,,0868-31-0088,,,,,,,,
���J(�z�[���y�[�W�ɕ\������),�Ղ�E�C�x���g,2023�N8��3��,8:45,16:30,�ÎR�s���w����ƌ��w�o�X�c�A�[,�s����Ƃق�,,,,,,,,�w�Z�����,�X,0868-32-2114,2405,,,,,,,
���J(�z�[���y�[�W�ɕ\������),�Ղ�E�C�x���g,2023�N8��3��,9:00,12:00,�@���܂��Â��苦�c��u�ċx�݂킭�킭�����v,�@��������(�_��),,,,,,,,�@���܂��Â��苦�c�����,���c,0868-28-0335,,,,,,,,
���J(�z�[���y�[�W�ɕ\������),�Ղ�E�C�x���g,2023�N8��3��,10:30,11:00,���͂Ȃ��^�C��,���k�}����(�V�쓌),708-1205,�ÎR�s�V�쓌584,35.104494,134.11017,0868-36-8622,,,���k�}����,,0868-36-8622,,http://tsuyamalib.tvt.ne.jp/event/shouhoku.html#ohanashitime,,,,,,
���J(�z�[���y�[�W�ɕ\������),���k,2023�N8��3��,13:00,16:00,�S�g��Q���������k(�m�I�E���B��Q),�ÎR�s�����������(�R�k),708-0004,�ÎR�s�R�k520,35.069357,134.00537,0868-23-5130,,,���R������Ȃ��琬��,,086-226-3538,,,,,,,,
���J(�z�[���y�[�W�ɕ\������),���N�E����,2023�N8��3��,13:30,15:00,�ߘa5�N�x��1��ÎR�s���N�Â��萄�i�R�c��,�ÎR�s�����c���1�ψ��(�R�k),708-8501,�ÎR�s�R�k520,35.069591,134.004579,0868-32-2140,,https://www.city.tsuyama.lg.jp,���N���i��,�X��C�^�؁C���^,0868-32-2069,3617�C3621,,,,,,,
���J(�z�[���y�[�W�ɕ\������),�Ղ�E�C�x���g,2023�N8��3��,14:30,,�ؗj�r�f�I��,�s���}����(�A���l�E�ÎR4�K),708-0065,�ÎR�s�V����17,35.05893,134.000516,0868-24-2919,,https://tsuyamalib.tvt.ne.jp/,�s���}����,,0868-24-2919,,http://tsuyamalib.tvt.ne.jp/event/tsuyama_family.html#video,,,,,,
���J(�z�[���y�[�W�ɕ\������),���k,2023�N8��3��,15:00,17:00,�ߎR�m���瑊�k,���瑊�k�Z���^�[�u�ߎR�m�v(���c��),,,,,,,,�ߎR�m,,0868-22-2523,,,,,,,,
���J(�z�[���y�[�W�ɕ\������),���̑�,2023�N8��4��,8:30,17:15,�u��\�΂��j����vWeb�A���P�[�g,,,,,,,,,������琬��,���J,868322009,2472,https://www.city.tsuyama.lg.jp/life/index2.php?id=9030,,,,,,
���J(�z�[���y�[�W�ɕ\������),���̑�,2023�N8��4��,8:30,17:15,��37��ÎR�s�����a�� ���a�p�l���W,�ÎR�s�����P�K�s�����r�[(�R�k),708-8501,�ÎR�s�R�k520,35.069591,134.004579,0868-32-2021,,,�l���[����,,0868-31-0088,,,,,,,,
���J(�z�[���y�[�W�ɕ\������),���k,2023�N8��4��,9:00,12:00,�s�����k,���k�x��(�V�쓌),,,,,,,,���k�x���n��U����,,0868-32-7023,,,,,,,,
���J(�z�[���y�[�W�ɕ\������),�Ղ�E�C�x���g,2023�N8��5��,,,�ό���ԁu���߂��v�����ĂȂ��C�x���g,JR�ÎR�w�k���L��(��J),,,,,,,,�ό��U����,�R�{,0868-32-2082,3312,,,,,,,
���J(�z�[���y�[�W�ɕ\������),���̑�,2023�N8��5��,8:30,17:15,�u��\�΂��j����vWeb�A���P�[�g,,,,,,,,,������琬��,���J,868322009,2472,https://www.city.tsuyama.lg.jp/life/index2.php?id=9030,,,,,,
���J(�z�[���y�[�W�ɕ\������),�Ղ�E�C�x���g,2023�N8��5��,9:00,,�ÎR�s�n�Y�n���Z���^�[�T���q���Y�u�储�~�s�v,�ÎR�s�n�Y�n���Z���^�[�u�T���q���Y�v(��c),,,,,,,,�ÎR�s�n�Y�n���Z���^�[�u�T���q���Y�v,,0868-27-7131,,,,,,,,
���J(�z�[���y�[�W�ɕ\������),�Ղ�E�C�x���g,2023�N8��5��,9:00,17:00,�ÎR���y�����ك~�j���W�u�����G�꒤���Ƃ��̐��E��v*9��18���܂�,�ÎR���y������(�R��),708-0022,�ÎR�s�R��92,35.060825,134.005657,0868-22-4567,,http://www.tsu-haku.jp/,�ÎR���y������,����,0868-22-4567,,,,,,,,
���J(�z�[���y�[�W�ɕ\������),�Ղ�E�C�x���g,2023�N8��5��,10:00,15:30,�ÎR�m�w�����ىċx�݋����u�ނ����̊w�҂���������w�����v,�ÎR�m�w������(���V��),708-0833,�ÎR�s���V��5,35.063673,134.016223,0868-23-3324,,http://www.tsuyama-yougaku.jp/,�ÎR�m�w������,,0868-23-3324,,,,,,,,
���J(�z�[���y�[�W�ɕ\������),�����E�|�p,2023�N8��5��,10:00,18:00,���R���b�K���X�W�uBlue��Olive�v*8��27���܂�,�|�[�g �A�[�g&amp;�f�U�C���ÎR(���),,,,,,,,�|�[�g �A�[�g&amp;�f�U�C���ÎR,,0868-20-1682,,,,,,,,
���J(�z�[���y�[�W�ɕ\������),���̑�,2023�N8��5��,10:00,19:00,��37��ÎR�s�����a�� ���a�p�l���W,�s���}���ّO�z�[��(�A���l�E�ÎR4�K:�V����),,,,,,,,�l���[����,,0868-31-0088,,,,,,,,
���J(�z�[���y�[�W�ɕ\������),�Ղ�E�C�x���g,2023�N8��5��,10:30,11:00,���͂Ȃ���,���Β��}����(���Β�����),709-3905,�ÎR�s���Β�����113-6,35.179056,134.055164,0868-42-7032,,,���Β��}����,,0868-42-7032,,http://tsuyamalib.tvt.ne.jp/event/kamo.html#ohanashikai,,,,,,
���J(�z�[���y�[�W�ɕ\������),���̑�,2023�N8��5��,10:30,11:30,��`�E���`�A�[�g,���΁i����ށj������(���Β�����),709-3931,�ÎR�s���Β�����97-1,35.174809,134.055647,0868-42-3168,,,���Ύ�����,,0868-42-3168,,,,,,,,
���J(�z�[���y�[�W�ɕ\������),�Ղ�E�C�x���g,2023�N8��5��,11:00,15:00,�}���فu�Ȃ������v�C�x���g �Ђ�����������&quot;�����&quot;,�s���}����(�A���l�E�ÎR4�K),708-0065,�ÎR�s�V����17,35.05893,134.000516,0868-24-2919,,https://tsuyamalib.tvt.ne.jp/,�s���}����,,0868-24-2919,,,,,,,,
���J(�z�[���y�[�W�ɕ\������),�Ղ�E�C�x���g,2023�N8��5��,12:30,14:30,�킭�킭�`�������W �؍H����*�\������7��22������,��i���C���C�j������(���R),708-0862,�ÎR�s���R26-2,35.053722,134.004253,0868-24-4400,,,�쎙����,,0868-24-4400,,,,,,,,
���J(�z�[���y�[�W�ɕ\������),�Ղ�E�C�x���g,2023�N8��5��,16:00,21:00,��45��ÎR�[�����񂲂܂�h�m�g���,�g���͐�~�C�z�ʂ�,,,,,,,,�ÎR�[�����񂲂܂���s�ψ������(�ό��U���ۓ�),�r�c�A����,0868-32-2082,3312,http://gongo.e-tsuyama.com/,,,,,,
���J(�z�[���y�[�W�ɕ\������),�Ղ�E�C�x���g,2023�N8��6��,,,�ό���ԁu���߂��v�����ĂȂ��C�x���g,JR�ÎR�w�k���L��(��J),,,,,,,,�ό��U����,�R�{,0868-32-2082,3312,,,,,,,
���J(�z�[���y�[�W�ɕ\������),���̑�,2023�N8��6��,8:30,17:15,�u��\�΂��j����vWeb�A���P�[�g,,,,,,,,,������琬��,���J,868322009,2472,https://www.city.tsuyama.lg.jp/life/index2.php?id=9030,,,,,,
���J(�z�[���y�[�W�ɕ\������),���̑�,2023�N8��6��,10:00,19:00,��37��ÎR�s�����a�� ���a�p�l���W,�s���}���ّO�z�[��(�A���l�E�ÎR4�K:�V����),,,,,,,,�l���[����,,0868-31-0088,,,,,,,,
���J(�z�[���y�[�W�ɕ\������),�Ղ�E�C�x���g,2023�N8��6��,10:30,12:00,���k�}���ٍs���u���E�̂��Ƃ΂ł����ڂ��v*��W����7��20������8��4���܂�,���k�����فi�V�쓌�j,,,,,,,,���k�}����,�����E���c,0868-36-8622,,,,,,,,
���J(�z�[���y�[�W�ɕ\������),�Ղ�E�C�x���g,2023�N8��6��,11:00,11:30,���͂Ȃ���,�v�Đ}����(���k��),709-4603,�ÎR�s���k��1271,35.060147,133.899566,0868-57-3444,,,�v�Đ}����,,0868-57-3444,,https://tsuyamalib.tvt.ne.jp/event/kume.html#ohanasi,,,,,,
���J(�z�[���y�[�W�ɕ\������),�Ղ�E�C�x���g,2023�N8��6��,13:00,16:00,���ׂ�w�K�ʑ��k��,�s���}����(�A���l�E�ÎR4�K),708-0065,�ÎR�s�V����17,35.05893,134.000516,0868-24-2919,,https://tsuyamalib.tvt.ne.jp/,�s���}����,����,0868-24-2919,2791,,,,,,,
���J(�z�[���y�[�W�ɕ\������),�Ղ�E�C�x���g,2023�N8��6��,16:00,21:00,��45��ÎR�[�����񂲂܂�h�m�g���,�g���͐�~,,,,,,,,�ÎR�[�����񂲂܂���s�ψ������(�ό��U���ۓ�),�r�c�A����,0868-32-2082,3312,http://gongo.e-tsuyama.com/,,,,,,
���J(�z�[���y�[�W�ɕ\������),���̑�,2023�N8��7��,8:30,17:15,�u��\�΂��j����vWeb�A���P�[�g,,,,,,,,,������琬��,���J,868322009,2472,https://www.city.tsuyama.lg.jp/life/index2.php?id=9030,,,,,,
���J(�z�[���y�[�W�ɕ\������),���N�E����,2023�N8��7��,10:00,11:30,�玙���N���k,�ÎR�����₩�E���ǂ��Z���^�[(�R�k),708-0004,�ÎR�s�R�k800,35.069076,134.009127,0868-32-2179,,,���N���i��,,0868-32-2069,,https://www.city.tsuyama.lg.jp/life/index2.php?id=8173,,,,,,
���J(�z�[���y�[�W�ɕ\������),���k,2023�N8��7��,13:30,16:40,�ƒ�Ǝq�ǂ��̖@�����k*�����E�\��v,�ÎR�����₩�E���ǂ��Z���^�[(�R�k),708-0004,�ÎR�s�R�k800,35.069076,134.009127,0868-32-2179,,,�q��Đ��i��,,0868-32-2065,,,,,,,,
���J(�z�[���y�[�W�ɕ\������),���̑�,2023�N8��8��,8:30,17:15,�u��\�΂��j����vWeb�A���P�[�g,,,,,,,,,������琬��,���J,868322009,2472,https://www.city.tsuyama.lg.jp/life/index2.php?id=9030,,,,,,
���J(�z�[���y�[�W�ɕ\������),���k,2023�N8��8��,9:00,11:00,�ߎR�m���瑊�k,���瑊�k�Z���^�[�u�ߎR�m�v(���c��),,,,,,,,�ߎR�m,,0868-22-2523,,,,,,,,
���J(�z�[���y�[�W�ɕ\������),�Ղ�E�C�x���g,2023�N8��8��,10:00,11:30,�ÎR���y�����ىĂ̊w�K�v���O�����u�g���{�ʂ����낤�v*���ߐ؂�7��26��,�ÎR���y������(�R��),708-0022,�ÎR�s�R��92,35.060825,134.005657,0868-22-4567,,http://www.tsu-haku.jp/,�ÎR���y������,,0868-22-4567,,,,,,,,
���J(�z�[���y�[�W�ɕ\������),���k,2023�N8��8��,10:00,15:00,�l���E�s�����k,���g������(���g),,,,,,,,���g�o�����n��U����,,0868-32-7042,,,,,,,,
���J(�z�[���y�[�W�ɕ\������),���̑�,2023�N8��8��,10:15,,�ÎR�s�E���̗p������,�ÎR�s����2�K���c��(�R�k),708-8501,�ÎR�s�R�k520,35.069591,134.004579,0868-32-2021,,https://www.city.tsuyama.lg.jp/,�l����,�O�Y,0868-32-2043,2382,,,,,,,
���J(�z�[���y�[�W�ɕ\������),���N�E����,2023�N8��8��,12:50,13:30,�������f,�ÎR�����₩�E���ǂ��Z���^�[(�R�k),708-0004,�ÎR�s�R�k800,35.069076,134.009127,0868-32-2179,,,���N���i��,,0868-32-2069,,https://www.city.tsuyama.lg.jp/life/index2.php?id=8226,,,,,,
���J(�z�[���y�[�W�ɕ\������),���̑�,2023�N8��9��,8:30,17:15,�u��\�΂��j����vWeb�A���P�[�g,,,,,,,,,������琬��,���J,868322009,2472,https://www.city.tsuyama.lg.jp/life/index2.php?id=9030,,,,,,
���J(�z�[���y�[�W�ɕ\������),�Ղ�E�C�x���g,2023�N8��9��,10:00,11:30,�ÎR���y�����ىĂ̊w�K�v���O�����u�g���{�ʂ����낤�v*���ߐ؂�7��26��,�ÎR���y������(�R��),708-0022,�ÎR�s�R��92,35.060825,134.005657,0868-22-4567,,http://www.tsu-haku.jp/,�ÎR���y������,,0868-22-4567,,,,,,,,
���J(�z�[���y�[�W�ɕ\������),�Ղ�E�C�x���g,2023�N8��9��,10:00,12:00,��l�̎Љ�w��1�e�u�����F�h�Њw�K�Z���^�[�ҁv*���ߐ؂�7��21��,�h�Њw�K�Z���^�[�i�ÎR������h�g�����h�{�����j�i�ѓc�j,,,,,,,,���U�w�K��,,0868-32-2118,,https://www.city.tsuyama.lg.jp/city/index2.php?id=9536,,,,,,
���J(�z�[���y�[�W�ɕ\������),�Ղ�E�C�x���g,2023�N8��9��,10:30,11:00,���ׂ����Ƃ��ق�̂�����,�s���}����(�A���l�E�ÎR4�K),708-0065,�ÎR�s�V����17,35.05893,134.000516,0868-24-2919,,https://tsuyamalib.tvt.ne.jp/,�s���}����,,0868-24-2919,,https://tsuyamalib.tvt.ne.jp/,,,,,,
���J(�z�[���y�[�W�ɕ\������),���N�E����,2023�N8��9��,12:50,13:30,�������f,�ÎR�����₩�E���ǂ��Z���^�[(�R�k),708-0004,�ÎR�s�R�k800,35.069076,134.009127,0868-32-2179,,,���N���i��,,0868-32-2069,,https://www.city.tsuyama.lg.jp/life/index2.php?id=8226,,,,,,
���J(�z�[���y�[�W�ɕ\������),���k,2023�N8��9��,13:00,15:00,�����������k,�ÎR�s�����������(�R�k),708-0004,�ÎR�s�R�k520,35.069357,134.00537,0868-23-5130,,,�ÎR�s�Љ�����c��,,0868-23-5130,,,,,,,,
���J(�z�[���y�[�W�ɕ\������),���k,2023�N8��9��,13:00,15:00,����s�����k,���Β������Z���^�[(���Β�������),,,,,,,,���Ύx���n��U����,,0868-32-7032,,,,,,,,
���J(�z�[���y�[�W�ɕ\������),���k,2023�N8��9��,13:15,17:15,�F�m�ǁE��N���F�m�Ǒ��k,�ÎR�s�n���x���Z���^�[(�ÎR�s����1�K:�R�k),,,,,,,,�ÎR�s�n���x���Z���^�[,,0868-23-1004,,,,,,,,
���J(�z�[���y�[�W�ɕ\������),���̑�,2023�N8��9��,15:30,16:00,������Ѓi���o�z�[���Z���^�[�u�K���̂��˃v���W�F�N�g2023�v�N�[�|�����掮,�ÎR�s����3�K���c��(�R�k),708-8501,�ÎR�s�R�k520,35.069591,134.004579,0868-32-2021,,https://www.city.tsuyama.lg.jp/,�w�Z�����,����,0868-32-2114,2406,,,,,,,
���J(�z�[���y�[�W�ɕ\������),���̑�,2023�N8��10��,8:30,17:15,�u��\�΂��j����vWeb�A���P�[�g,,,,,,,,,������琬��,���J,868322009,2472,https://www.city.tsuyama.lg.jp/life/index2.php?id=9030,,,,,,
���J(�z�[���y�[�W�ɕ\������),���̑�,2023�N8��10��,8:30,17:15,�O�٘A�g15���N�L�O�W��*8��24���܂�,�ÎR�s�����P�K�s�����r�[(�R�k),708-8501,�ÎR�s�R�k520,35.069591,134.004579,0868-32-2021,,,�s���}����,���,0868-24-2919,2784,,,,,,,
���J(�z�[���y�[�W�ɕ\������),�Ղ�E�C�x���g,2023�N8��10��,9:30,12:00,�@���܂��Â��苦�c��u�A�}�`���A�����̌���v,�@��������(�_��),,,,,,,,�@���܂��Â��苦�c�����,���c,0868-28-0335,,,,,,,,
���J(�z�[���y�[�W�ɕ\������),�Ղ�E�C�x���g,2023�N8��10��,14:30,,�ؗj�r�f�I��,�s���}����(�A���l�E�ÎR4�K),708-0065,�ÎR�s�V����17,35.05893,134.000516,0868-24-2919,,https://tsuyamalib.tvt.ne.jp/,�s���}����,,0868-24-2919,,http://tsuyamalib.tvt.ne.jp/event/tsuyama_family.html#video,,,,,,
���J(�z�[���y�[�W�ɕ\������),���̑�,2023�N8��10��,14:30,17:00,��܉��_�m ��b�E���H�u��(��ؕ��� �u���b�R���[��A),JA����̍����R�ÎR�����A�O���Z���^�[(�쑺)�C�A�O���x��ޏ�(�x��),,,,,,,,�_�ƐU����,�O�c,0868-32-2079,2456,,,,,,,
���J(�z�[���y�[�W�ɕ\������),�Ղ�E�C�x���g,2023�N8��11��,7:00,10:00,��B�ÎR�{�쒩�s*����؂ꎟ��I��,�{��͐�~�E��k�����l(�R�k),,,,,,,,�r�W�l�X�_�ыƐ��i��,,0868-32-2178,,,,,,,,
���J(�z�[���y�[�W�ɕ\������),���̑�,2023�N8��11��,8:30,17:15,�u��\�΂��j����vWeb�A���P�[�g,,,,,,,,,������琬��,���J,868322009,2472,https://www.city.tsuyama.lg.jp/life/index2.php?id=9030,,,,,,
���J(�z�[���y�[�W�ɕ\������),�Ղ�E�C�x���g,2023�N8��11��,9:30,,����ō��in�ċx��(1)9��30������(2)11������(3)13������(4)14��30������*���O�\��v,�ÎR��i�ߎR�����j,708-0022,�ÎR�s�R���ÎR��,35.061527,134.005635,0868-23-2111,"&nbsp; �ÎR��́A�X�������c��9�N�i1604�j�ɒz��ɂ�����A���a2�N�i1616�j�̊����܂�13�N�̍Ό���v���܂����B
�@���͐X���i4��j�A�������i9��j�Ƒ��������ېV���}���Ă��܂��B���̌㖾��4�N�i1871�j�ɂ͔p�˒u���A��6�N�ɂ͔p��߁A��7�N�ɂ͓V��A���~�A�E�A��Ȃǌ����͂��ׂĎ��󂳂�Ί_�݂̂��c��܂����B
�@��Ղ͈�x�r�����ƂȂ�܂����A����33�N�i1900�j�ɂ͒ߎR�����Ƃ��čďo���A���a38�N�i1963�j�ɂ͍��w��d�v�������i�j�Ձj�Ɏw�肳��܂����B",,�ÎR��(�ߎR����),�L��,0868-22-4572,,,,,,,,
���J(�z�[���y�[�W�ɕ\������),�Ղ�E�C�x���g,2023�N8��12��,,,�y���~�z�T�}�[�t�F�X�e�B�o��IN����2023,����r����(�s��),,,,,,,,�T�}�[�t�F�X�e�B�o��IN������s�ψ������(���k�x���n��U����),�Z��C�e�R,0868-32-7021,5110,,,,,,,
���J(�z�[���y�[�W�ɕ\������),���̑�,2023�N8��12��,8:30,17:15,�u��\�΂��j����vWeb�A���P�[�g,,,,,,,,,������琬��,���J,868322009,2472,https://www.city.tsuyama.lg.jp/life/index2.php?id=9030,,,,,,
���J(�z�[���y�[�W�ɕ\������),�Ղ�E�C�x���g,2023�N8��12��,9:30,,����ō��in�ċx��(1)9��30������(2)11������(3)13������(4)14��30������*���O�\��v,�ÎR��i�ߎR�����j,708-0022,�ÎR�s�R���ÎR��,35.061527,134.005635,0868-23-2111,"&nbsp; �ÎR��́A�X�������c��9�N�i1604�j�ɒz��ɂ�����A���a2�N�i1616�j�̊����܂�13�N�̍Ό���v���܂����B
�@���͐X���i4��j�A�������i9��j�Ƒ��������ېV���}���Ă��܂��B���̌㖾��4�N�i1871�j�ɂ͔p�˒u���A��6�N�ɂ͔p��߁A��7�N�ɂ͓V��A���~�A�E�A��Ȃǌ����͂��ׂĎ��󂳂�Ί_�݂̂��c��܂����B
�@��Ղ͈�x�r�����ƂȂ�܂����A����33�N�i1900�j�ɂ͒ߎR�����Ƃ��čďo���A���a38�N�i1963�j�ɂ͍��w��d�v�������i�j�Ձj�Ɏw�肳��܂����B",,�ÎR��(�ߎR����),�L��,0868-22-4572,,,,,,,,
���J(�z�[���y�[�W�ɕ\������),���̑�,2023�N8��13��,8:30,17:15,�u��\�΂��j����vWeb�A���P�[�g,,,,,,,,,������琬��,���J,868322009,2472,https://www.city.tsuyama.lg.jp/life/index2.php?id=9030,,,,,,
���J(�z�[���y�[�W�ɕ\������),���k,2023�N8��13��,9:00,16:00,IJU�^�[�����k��������*���O�\��v,�ÎR���斳���E�ƏЉ�Z���^�[(�ÎR����ٗp�J���Z���^�[��:�R��),,,,,,,,�ÎR���斳���E�ƏЉ�Z���^�[,,0868-24-3633,,,,,,,,
���J(�z�[���y�[�W�ɕ\������),�Ղ�E�C�x���g,2023�N8��13��,18:00,20:30,���g�ӂ邳�Ƃӂꂠ���[������Ղ�*�ԉ�20��15������,���Ό𗬊ْ��ԏ�(���g),,,,,,,,���g�ӂ邳�Ƃӂꂠ���[������Ղ���s�ψ������(���g�o�����n��U���ۓ�),����,0868-32-7042,4521,,,,,,,
���J(�z�[���y�[�W�ɕ\������),���̑�,2023�N8��14��,8:30,17:15,�u��\�΂��j����vWeb�A���P�[�g,,,,,,,,,������琬��,���J,868322009,2472,https://www.city.tsuyama.lg.jp/life/index2.php?id=9030,,,,,,
���J(�z�[���y�[�W�ɕ\������),���k,2023�N8��14��,9:00,17:00,IJU�^�[�����k��������*���O�\��v,�ÎR���斳���E�ƏЉ�Z���^�[(�ÎR����ٗp�J���Z���^�[��:�R��),,,,,,,,�ÎR���斳���E�ƏЉ�Z���^�[,,0868-24-3633,,,,,,,,
���J(�z�[���y�[�W�ɕ\������),���N�E����,2023�N8��14��,10:00,11:30,�玙���N���k,�ÎR�����₩�E���ǂ��Z���^�[(�R�k),708-0004,�ÎR�s�R�k800,35.069076,134.009127,0868-32-2179,,,���N���i��,,0868-32-2069,,https://www.city.tsuyama.lg.jp/life/index2.php?id=8173,,,,,,
���J(�z�[���y�[�W�ɕ\������),�Ղ�E�C�x���g,2023�N8��14��,19:00,,�����̉Ă܂�*�ԉ�21��50������,���Β��w�Z�i���Β��K���j,,,,,,,,�����̉Ă܂���s�ψ�����ǁi��B�ÎR���H����Ύx�����j,,0868-42-2092,,,,,,,,
���J(�z�[���y�[�W�ɕ\������),���̑�,2023�N8��15��,8:30,17:15,�u��\�΂��j����vWeb�A���P�[�g,,,,,,,,,������琬��,���J,868322009,2472,https://www.city.tsuyama.lg.jp/life/index2.php?id=9030,,,,,,
���J(�z�[���y�[�W�ɕ\������),���k,2023�N8��15��,9:00,17:00,IJU�^�[�����k��������*���O�\��v,�ÎR���斳���E�ƏЉ�Z���^�[(�ÎR����ٗp�J���Z���^�[��:�R��),,,,,,,,�ÎR���斳���E�ƏЉ�Z���^�[,,0868-24-3633,,,,,,,,
���J(�z�[���y�[�W�ɕ\������),���̑�,2023�N8��16��,8:30,17:15,�u��\�΂��j����vWeb�A���P�[�g,,,,,,,,,������琬��,���J,868322009,2472,https://www.city.tsuyama.lg.jp/life/index2.php?id=9030,,,,,,
���J(�z�[���y�[�W�ɕ\������),���k,2023�N8��16��,9:00,17:00,IJU�^�[�����k��������*���O�\��v,�ÎR���斳���E�ƏЉ�Z���^�[(�ÎR����ٗp�J���Z���^�[��:�R��),,,,,,,,�ÎR���斳���E�ƏЉ�Z���^�[,,0868-24-3633,,,,,,,,
���J(�z�[���y�[�W�ɕ\������),���k,2023�N8��16��,10:00,15:00,�s�����k,���Β�������(���Β�����),709-3905,�ÎR�s���Β�����104,35.178164,134.054532,0868-42-3035,,,���Ύx���n��U����,,0868-32-7032,,,,,,,,
���J(�z�[���y�[�W�ɕ\������),�Ղ�E�C�x���g,2023�N8��16��,10:30,11:00,�����Ȏq�ǂ��̂��ق�̂�����,�s���}����(�A���l�E�ÎR4�K),708-0065,�ÎR�s�V����17,35.05893,134.000516,0868-24-2919,,https://tsuyamalib.tvt.ne.jp/,�s���}����,,0868-24-2919,,https://tsuyamalib.tvt.ne.jp/event/tsuyama_kodomo.html#ehon,,,,,,
���J(�z�[���y�[�W�ɕ\������),���k,2023�N8��16��,13:30,15:30,�i�@���m�@�����k*�����E�\��v,�ÎR�s����1�K��������(�R�k),,,,,,,,��������,,0868-32-2057,,,,,,,,
���J(�z�[���y�[�W�ɕ\������),���̑�,2023�N8��17��,8:30,17:15,�u��\�΂��j����vWeb�A���P�[�g,,,,,,,,,������琬��,���J,868322009,2472,https://www.city.tsuyama.lg.jp/life/index2.php?id=9030,,,,,,
���J(�z�[���y�[�W�ɕ\������),���k,2023�N8��17��,9:00,12:00,�l���E�����������k,���k�ی������Z���^�[(�V�쓌),,,,,,,,���k�x���n��U����,,0868-32-7023,,,,,,,,
���J(�z�[���y�[�W�ɕ\������),���k,2023�N8��17��,9:00,17:00,IJU�^�[�����k��������*���O�\��v,�ÎR���斳���E�ƏЉ�Z���^�[(�ÎR����ٗp�J���Z���^�[��:�R��),,,,,,,,�ÎR���斳���E�ƏЉ�Z���^�[,,0868-24-3633,,,,,,,,
���J(�z�[���y�[�W�ɕ\������),�Ղ�E�C�x���g,2023�N8��17��,11:00,11:30,���͂Ȃ���,�s���}����(�A���l�E�ÎR4�K),708-0065,�ÎR�s�V����17,35.05893,134.000516,0868-24-2919,,https://tsuyamalib.tvt.ne.jp/,�s���}����,,0868-24-2919,,http://tsuyamalib.tvt.ne.jp/event/tsuyama_kodomo.html#ohanashikai,,,,,,
���J(�z�[���y�[�W�ɕ\������),���N�E����,2023�N8��17��,13:30,16:00,�D�w���Ȍ��f*�\��v,�ÎR���Ȉ�ÃZ���^�[�f�Ï��i���j,,,,,,,,���N���i��,,0868-32-2069,,,,,,,,
���J(�z�[���y�[�W�ɕ\������),�Ղ�E�C�x���g,2023�N8��17��,14:30,,�ؗj�r�f�I��,�s���}����(�A���l�E�ÎR4�K),708-0065,�ÎR�s�V����17,35.05893,134.000516,0868-24-2919,,https://tsuyamalib.tvt.ne.jp/,�s���}����,,0868-24-2919,,http://tsuyamalib.tvt.ne.jp/event/tsuyama_family.html#video,,,,,,
���J(�z�[���y�[�W�ɕ\������),���̑�,2023�N8��18��,8:30,17:15,�u��\�΂��j����vWeb�A���P�[�g,,,,,,,,,������琬��,���J,868322009,2472,https://www.city.tsuyama.lg.jp/life/index2.php?id=9030,,,,,,
���J(�z�[���y�[�W�ɕ\������),���k,2023�N8��18��,9:00,17:00,IJU�^�[�����k��������*���O�\��v,�ÎR���斳���E�ƏЉ�Z���^�[(�ÎR����ٗp�J���Z���^�[��:�R��),,,,,,,,�ÎR���斳���E�ƏЉ�Z���^�[,,0868-24-3633,,,,,,,,
���J(�z�[���y�[�W�ɕ\������),���k,2023�N8��18��,10:00,15:00,�s�����k�ψ��E���ؐl�������k,�ÎR�s�����������(�R�k),708-0004,�ÎR�s�R�k520,35.069357,134.00537,0868-23-5130,,,���R�s���Ď��s�����k�Z���^�[,,086-231-4321,,,,,,,,
���J(�z�[���y�[�W�ɕ\������),�Ղ�E�C�x���g,2023�N8��18��,13:30,14:30,�̘b�̂��͂Ȃ���X�y�V�����E��,���Β��}����(���Β�����),709-3905,�ÎR�s���Β�����113-6,35.179056,134.055164,0868-42-7032,,,���Β��}����,,0868-42-7032,,http://tsuyamalib.tvt.ne.jp/event/kamo.html#ohanashikai,,,,,,
���J(�z�[���y�[�W�ɕ\������),�Ղ�E�C�x���g,2023�N8��18��,13:30,16:00,���R���k�A���t�F�A,�ÎR�����̈��(�R�k),708-0004,�ÎR�s�R�k669,35.068894,134.008458,0868-24-0202,,,�ÎR�L�掖���g��,����,0868-24-3633,3838,,,,,,,
���J(�z�[���y�[�W�ɕ\������),���̑�,2023�N8��19��,,,�ÎR�s�玙�x�Ƒ�֔C���t�E���̗p����,�ÎR�s����2�K���c��(�R�k),708-8501,�ÎR�s�R�k520,35.069591,134.004579,0868-32-2021,,https://www.city.tsuyama.lg.jp/,�l����,�O�Y,0868-32-2043,2382,,,,,,,
���J(�z�[���y�[�W�ɕ\������),���̑�,2023�N8��19��,8:30,17:15,�u��\�΂��j����vWeb�A���P�[�g,,,,,,,,,������琬��,���J,868322009,2472,https://www.city.tsuyama.lg.jp/life/index2.php?id=9030,,,,,,
���J(�z�[���y�[�W�ɕ\������),�����E�|�p,2023�N8��19��,9:00,17:00,�u���w�E�m�w �O�Ó����v�����L�O����W ����150�N���N�L�O �����J���Ɩ��Z��*�I�[�v�j���O�Z�����j�[9��30������*9��18���܂�,�ÎR�m�w������(���V��),708-0833,�ÎR�s���V��5,35.063673,134.016223,0868-23-3324,,http://www.tsuyama-yougaku.jp/,�ÎR�m�w������,,0868-23-3324,,,,,,,,
���J(�z�[���y�[�W�ɕ\������),�Ղ�E�C�x���g,2023�N8��19��,13:30,,�����ԂŃJ�����_�[����낤!(1)13��30������(2)14��30������*�\������8��1������17���܂�,�v�Đ}����(���k��),709-4603,�ÎR�s���k��1271,35.060147,133.899566,0868-57-3444,,,�v�Đ}����,,0868-57-3444,,,,,,,,
���J(�z�[���y�[�W�ɕ\������),���̑�,2023�N8��19��,13:30,15:00,�e�q�̗��ȋ���-�Đ��\�G�l���M�[�͌^�̐���-,�ÎR�j�������Q��Z���^�[�u����E����v(�A���l�E�ÎR5�K),708-8520,�ÎR�s�V����17�@�A���l�E�ÎR5�K,35.05893,134.000516,0868-31-2533,,https://www.city.tsuyama.lg.jp/life/index2.php?id=2051,����E����,,0868-31-2533,,,,,,,,
���J(�z�[���y�[�W�ɕ\������),���̑�,2023�N8��20��,8:30,17:15,�u��\�΂��j����vWeb�A���P�[�g,,,,,,,,,������琬��,���J,868322009,2472,https://www.city.tsuyama.lg.jp/life/index2.php?id=9030,,,,,,
���J(�z�[���y�[�W�ɕ\������),���̑�,2023�N8��20��,10:00,12:00,��܎q�ǂ��ό��K�C�h�琬�m-�ÎR�̋����̂Ђ݂�T�낤-,�ÎR���y������(�R��),708-0022,�ÎR�s�R��92,35.060825,134.005657,0868-22-4567,,http://www.tsu-haku.jp/,�w�Z�����,����,0868-32-2114,2406,,,,,,,
���J(�z�[���y�[�W�ɕ\������),�Ղ�E�C�x���g,2023�N8��20��,10:30,11:00,���͂Ȃ��^�C��,���k�}����(�V�쓌),708-1205,�ÎR�s�V�쓌584,35.104494,134.11017,0868-36-8622,,,���k�}����,,0868-36-8622,,http://tsuyamalib.tvt.ne.jp/event/shouhoku.html#ohanashitime,,,,,,