�敪1,�敪2,�J�Ó�,�J�n����,�I������,�C�x���g��,�J�Ïꏊ,�X�֔ԍ�,�Z��,�ܓx,�o�x,�d�b�ԍ�,�{�ݐ���,�{��URL,�S���ҏ���,�S���Җ�,�S���ғd�b�ԍ�,�S���ғ���,URL,������,�|�C���g,���e,���ʐE�̏o�ȏ��,�Y�t���ނ̗L��,�񓹘A���p����o��
���J(�z�[���y�[�W�ɕ\������),�Ղ�E�C�x���g,2023�N10��1��,,,�ÎR�܂Ȃт̓S���ف`�򌴂ӂꂠ���z�R�����u���g�������[�o�X2023-���R�L��S�������ٍ�-�v,�ÎR�܂Ȃт̓S���فi��J�j�ق�,,,,,,,,�ό��U����,�v��,0868-32-2082,3312,,,,,,,
���J(�z�[���y�[�W�ɕ\������),���N�E����,2023�N10��1��,9:00,12:00,����Ҏ��Ȍ��f�E���k*�\��v,�ÎR���Ȉ�ÃZ���^�[�f�Ï�(��),,,,,,,,�ÎR���Ȉ�ÃZ���^�[�f�Ï�,,0868-22-4021,,https://www.city.tsuyama.lg.jp/life/index2.php?id=2601,,,,,,
���J(�z�[���y�[�W�ɕ\������),���̑�,2023�N10��1��,10:00,12:00,��܎q�ǂ��ό��K�C�h�琬�m-��������������ĐH�ׂĂ݂悤-,�ÎR��������(���),,,,,,,,�w�Z�����,����,0868-32-2114,2406,,,,,,,
���J(�z�[���y�[�W�ɕ\������),���N�E����,2023�N10��1��,10:00,12:00,�n���[�x�r�[����3���*�\��v,�ÎR�����₩�E���ǂ��Z���^�[(�R�k),708-0004,�ÎR�s�R�k800,35.069076,134.009127,0868-32-2179,,,���N���i��,,0868-32-2069,,https://www.city.tsuyama.lg.jp/life/index2.php?id=8157,,,,,,
���J(�z�[���y�[�W�ɕ\������),�Ղ�E�C�x���g,2023�N10��1��,10:00,15:00,�ÎR�E�鐼�܂邲�Ɣ����كt�F�A2023,�鐼�n��(��B���|�فC�鐼�Q���فC�鉺�����j�ςȂ�),,,,,,,,�ÎR�E�鐼�܂邲�Ɣ����كt�F�A���s�ψ������(�鐼�Q���ٓ�),,0868-22-8688,,,,,,,,
���J(�z�[���y�[�W�ɕ\������),�Ղ�E�C�x���g,2023�N10��1��,10:00,16:00,�ÎR�r�b�O�}���V�F,�O���[���q���Y�ÎR(��c),,,,,,,,����}���V�F�ÎR�����ǁi���R����j,,090-1683-0291,,,,,,,,
���J(�z�[���y�[�W�ɕ\������),���N�E����,2023�N10��1��,11:00,12:00,�Ԃ��H����������X�����,�A���l�E�ÎR(�V����),,,,,,,,�ÎR�s��������ψ���(�ÎR�s�Љ�����c���),���z,0868-23-5130,2766,,,,,,,
���J(�z�[���y�[�W�ɕ\������),���N�E����,2023�N10��2��,10:00,11:30,�玙���N���k,�ÎR�����₩�E���ǂ��Z���^�[(�R�k),708-0004,�ÎR�s�R�k800,35.069076,134.009127,0868-32-2179,,,���N���i��,,0868-32-2069,,https://www.city.tsuyama.lg.jp/life/index2.php?id=8173,,,,,,
���J(�z�[���y�[�W�ɕ\������),���k,2023�N10��2��,13:30,16:40,�ƒ�Ǝq�ǂ��̖@�����k*�����E�\��v,�ÎR�����₩�E���ǂ��Z���^�[(�R�k),708-0004,�ÎR�s�R�k800,35.069076,134.009127,0868-32-2179,,,�q��Đ��i��,,0868-32-2065,,,,,,,,
���J(�z�[���y�[�W�ɕ\������),�Ղ�E�C�x���g,2023�N10��2��,14:00,15:30,�Ђ������藝���̂��߂̍u����,�ÎR�s�����������(�R�k),708-0004,�ÎR�s�R�k520,35.069357,134.00537,0868-23-5130,,,����ψ������琬��,���{,0868-32-2120,2473,https://www.city.tsuyama.lg.jp/admin/contents/page/php/edit.php?id=9607,,,,,,
���J(�z�[���y�[�W�ɕ\������),�Ղ�E�C�x���g,2023�N10��2��,15:45,16:45,�Ђ������蓖���҂̉Ƒ��̂ǂ�,�ÎR�s�����������(�R�k),708-0004,�ÎR�s�R�k520,35.069357,134.00537,0868-23-5130,,,����ψ������琬��,���{,0868-32-2120,2473,https://www.city.tsuyama.lg.jp/admin/contents/page/php/edit.php?id=9682,,,,,,
���J(�z�[���y�[�W�ɕ\������),���k,2023�N10��3��,9:00,11:00,�ߎR�m���瑊�k,���瑊�k�Z���^�[�u�ߎR�m�v(���c��),,,,,,,,�ߎR�m,,0868-22-2523,,,,,,,,
���J(�z�[���y�[�W�ɕ\������),���N�E����,2023�N10��3��,12:50,13:30,1��6�J�������f,�ÎR�����₩�E���ǂ��Z���^�[(�R�k),708-0004,�ÎR�s�R�k800,35.069076,134.009127,0868-32-2179,,,���N���i��,,0868-32-2069,,https://www.city.tsuyama.lg.jp/life/index2.php?id=8226,,,,,,
���J(�z�[���y�[�W�ɕ\������),���N�E����,2023�N10��4��,12:50,13:30,1��6�J�������f,�ÎR�����₩�E���ǂ��Z���^�[(�R�k),708-0004,�ÎR�s�R�k800,35.069076,134.009127,0868-32-2179,,,���N���i��,,0868-32-2069,,https://www.city.tsuyama.lg.jp/life/index2.php?id=8226,,,,,,
���J(�z�[���y�[�W�ɕ\������),���̑�,2023�N10��5��,9:00,9:30,�{���ɏ��h�P��,�ÎR�s����(�R�k),708-8501,�ÎR�s�R�k520,35.069591,134.004579,0868-32-2021,,https://www.city.tsuyama.lg.jp,���Y���p��,����A�����A���,0868-32-2122,3905,,,,,,,
���J(�z�[���y�[�W�ɕ\������),�Ղ�E�C�x���g,2023�N10��5��,10:00,18:00,��69�񉪎R���������k�����W(�ÎR���)*10��10��15���܂�,�s�������W���z�[��(�A���l�E�ÎR4�K),,,,,,,,������,���X��,0868-32-2121,3262,,,,,,,
���J(�z�[���y�[�W�ɕ\������),���k,2023�N10��5��,13:00,16:00,�S�g��Q���������k(�m�I�E���B��Q),�ÎR�s�����������(�R�k),708-0004,�ÎR�s�R�k520,35.069357,134.00537,0868-23-5130,,,���R������Ȃ��琬��,,086-226-3538,,,,,,,,
���J(�z�[���y�[�W�ɕ\������),���k,2023�N10��5��,13:30,16:30,�ߎR�m���瑊�k,���瑊�k�Z���^�[�u�ߎR�m�v(���c��),,,,,,,,�ߎR�m,,0868-22-2523,,,,,,,,
���J(�z�[���y�[�W�ɕ\������),���N�E����,2023�N10��6��,14:30,16:00,�Q�[�g�L�[�p�[�E�����^���T�|�[�^�[�{���u���u�X���ɂ��āv*�\������9��15��,�ÎR�s�����������(�R�k),708-0004,�ÎR�s�R�k520,35.069357,134.00537,0868-23-5130,,,���N���i��,�q��,0868-32-2069,3622,,,,,,,
���J(�z�[���y�[�W�ɕ\������),���j,2023�N10��7��,9:00,17:00,�ÎR�m�w�����ٌ�����W�u�y���[���q170���N�L�O �`���ꂽ���D�͑��v*�ߘa6�N2��18���܂�,�ÎR�m�w������(���V��),708-0833,�ÎR�s���V��5,35.063673,134.016223,0868-23-3324,,http://www.tsuyama-yougaku.jp/,�ÎR�m�w������,,0868-23-3324,,,,,,,,
���J(�z�[���y�[�W�ɕ\������),�����E�|�p,2023�N10��7��,10:00,18:00,��24���B�̖��|���̂Â���W*10��15���܂�,�|�[�g�@�A�[�g���f�U�C���ÎR�i���j,,,,,,,,�|�[�g�A�[�g�f�U�C���ÎR,,0868-20-1682,,,,,,,,
���J(�z�[���y�[�W�ɕ\������),���N�E����,2023�N10��7��,10:00,19:00,���N�Â���p�l���W*10��30���܂�,�s���}����(�A���l�E�ÎR4�K),708-0065,�ÎR�s�V����17,35.05893,134.000516,0868-24-2919,,https://tsuyamalib.tvt.ne.jp/,��Õی���,,0868-32-2071,,,,,,,,
���J(�z�[���y�[�W�ɕ\������),�Ղ�E�C�x���g,2023�N10��7��,13:30,16:00,�q�����L�E�ۑ���� ifLink �I�I�M��,�ÎR�H�ƍ������w�Z(��),,,,,,,,��܎Y�Ǝx���Z���^�[,�蓇�C�͌�,0868-24-0740,3155,,,,,,,
���J(�z�[���y�[�W�ɕ\������),�Ղ�E�C�x���g,2023�N10��8��,7:00,10:00,��B�ÎR�{�쒩�s*����؂ꎟ��I��,�{��͐�~�E��k�����l(�R�k),,,,,,,,�r�W�l�X�_�ыƐ��i��,,0868-32-2178,,,,,,,,
���J(�z�[���y�[�W�ɕ\������),�Ղ�E�C�x���g,2023�N10��8��,9:00,,��܃X�|�[�c�t�F�X�e�B�o��*�J�V��10��9���ɏ���,�ÎR���㋣�Z��(�u�˕�)�A���[�h�V�X�e���e�j�X�R�[�g(����),,,,,,,,�X�|�[�c��,,0868-24-0202,,,,,,,,
���J(�z�[���y�[�W�ɕ\������),�Ղ�E�C�x���g,2023�N10��8��,9:30,15:00,���̉w�u�v�Ă̗��v�H�̖��o�E���n��,���̉w�u�v�Ă̗��v(�{��),,,,,,,,���̉w�u�v�Ă̗��v,,0868-57-7234,,,,,,,,
���J(�z�[���y�[�W�ɕ\������),�Ղ�E�C�x���g,2023�N10��8��,12:30,,���c�_�Ђ̎��q��,���c�_�Ёi�㉡��j,,,,,,,,�ό��U����,,0868-32-2082,,,,,,,,
���J(�z�[���y�[�W�ɕ\������),���N�E����,2023�N10��9��,14:00,15:30,���N�Z�~�i�[�u�����t���a�̕a�C�ƐH���̂��b�v*�\������9��18������10��8���܂�,�s���}����(�A���l�E�ÎR4�K),708-0065,�ÎR�s�V����17,35.05893,134.000516,0868-24-2919,,https://tsuyamalib.tvt.ne.jp/,�s���}����,,0868-24-2919,,,,,,,,
���J(�z�[���y�[�W�ɕ\������),���k,2023�N10��10��,10:00,15:00,�l���E�s�����k,���g������(���g),,,,,,,,���g�o�����n��U����,,0868-32-7042,,,,,,,,
���J(�z�[���y�[�W�ɕ\������),���N�E����,2023�N10��10��,12:50,13:30,�������f,�ÎR�����₩�E���ǂ��Z���^�[(�R�k),708-0004,�ÎR�s�R�k800,35.069076,134.009127,0868-32-2179,,,���N���i��,,0868-32-2069,,https://www.city.tsuyama.lg.jp/life/index2.php?id=8226,,,,,,
���J(�z�[���y�[�W�ɕ\������),���N�E����,2023�N10��10��,15:00,16:30,�F�m�ǖ{�l�~�[�e�B���O*���ߐ؂�9��26��,�i�����Ƃ�(�ѓc),,,,,,,,�ÎR�s�n���x���Z���^�[,,0868-23-1004,,,,,,,,
���J(�z�[���y�[�W�ɕ\������),���N�E����,2023�N10��11��,12:50,13:30,�������f,�ÎR�����₩�E���ǂ��Z���^�[(�R�k),708-0004,�ÎR�s�R�k800,35.069076,134.009127,0868-32-2179,,,���N���i��,,0868-32-2069,,https://www.city.tsuyama.lg.jp/life/index2.php?id=8226,,,,,,
���J(�z�[���y�[�W�ɕ\������),���k,2023�N10��11��,13:00,15:00,����s�����k,���Β������Z���^�[(���Β�������),,,,,,,,���Ύx���n��U����,,0868-32-7032,,,,,,,,
���J(�z�[���y�[�W�ɕ\������),���k,2023�N10��11��,13:00,15:00,�����������k,�ÎR�s�����������(�R�k),708-0004,�ÎR�s�R�k520,35.069357,134.00537,0868-23-5130,,,�ÎR�s�Љ�����c��,,0868-23-5130,,,,,,,,
���J(�z�[���y�[�W�ɕ\������),���k,2023�N10��11��,13:15,17:15,�F�m�ǁE��N���F�m�Ǒ��k,�ÎR�s�n���x���Z���^�[(�ÎR�s����1�K:�R�k),,,,,,,,�ÎR�s�n���x���Z���^�[,,0868-23-1004,,,,,,,,
���J(�z�[���y�[�W�ɕ\������),���k,2023�N10��11��,13:30,15:30,�i�@���m�@�����k*�����E�\��v,�ÎR�s����1�K��������(�R�k),,,,,,,,��������,,0868-32-2057,,,,,,,,
���J(�z�[���y�[�W�ɕ\������),���k,2023�N10��12��,15:00,17:00,�ߎR�m���瑊�k,���瑊�k�Z���^�[�u�ߎR�m�v(���c��),,,,,,,,�ߎR�m,,0868-22-2523,,,,,,,,
���J(�z�[���y�[�W�ɕ\������),���̑�,2023�N10��13��,,,�s�����k�p�l���W*10��20���܂�,�ÎR�s�����P�K�s�����r�[(�R�k),708-8501,�ÎR�s�R�k520,35.069591,134.004579,0868-32-2021,,,���R�s���Ď��s�����k�Z���^�[,�ؐX�C����,086-231-4321,,,,,,,,
���J(�z�[���y�[�W�ɕ\������),���k,2023�N10��13��,9:00,12:00,�s�����k,���k�x��(�V�쓌),,,,,,,,���k�x���n��U����,,0868-32-7023,,,,,,,,
���J(�z�[���y�[�W�ɕ\������),���̑�,2023�N10��13��,13:15,,�s�����L�҉,�ÎR�s����3�K���c��(�R�k),708-8501,�ÎR�s�R�k520,35.069591,134.004579,0868-32-2021,,https://www.city.tsuyama.lg.jp/,�鏑�L��,�L��,0868-32-2029,2315,,,,,,,
���J(�z�[���y�[�W�ɕ\������),���N�E����,2023�N10��13��,14:00,15:30,��삨�������u���u�ڂ���E���R�̂��ނu���v,���k�����Z���^�[(�V�쓌),708-1205,�ÎR�s�V�쓌584,35.104466,134.110337,0868-36-7121,,,�ÎR�s�n���x���Z���^�[,,0868-23-1004,,,,,,,,
���J(�z�[���y�[�W�ɕ\������),�Ղ�E�C�x���g,2023�N10��14��,,,B3���[�O������u�g���C�t�[�v���Rvs����u���[�E�B���Y�v,�ÎR�����̈��(�R�k),708-0004,�ÎR�s�R�k669,35.068894,134.008458,0868-24-0202,,,�g���C�t�[�v���R,,086-230-3886,,,,,,,,
���J(�z�[���y�[�W�ɕ\������),�Ղ�E�C�x���g,2023�N10��14��,,,�ÎR�܂Ȃт̓S���ف`�򌴂ӂꂠ���z�R�����u���g�������[�o�X2023-���R�L��S�������ٍ�-�v,�ÎR�܂Ȃт̓S���فi��J�j�ق�,,,,,,,,�ό��U����,�v��,0868-32-2082,3312,,,,,,,
���J(�z�[���y�[�W�ɕ\������),���̑�,2023�N10��14��,,,�s���㌩�l�{���u��*���ߐ؂�9��22��,�ÎR�s�����������(�R�k),708-0004,�ÎR�s�R�k520,35.069357,134.00537,0868-23-5130,,,�ÎR�s�Љ�����c�� �ÎR�s�����i��Z���^�[�u�炢�Ƃ���v,,0868-23-7978,,,,,,,,
���J(�z�[���y�[�W�ɕ\������),�Ղ�E�C�x���g,2023�N10��14��,10:00,,��Q�Q��X�т��l���鉪�R�����̂ǂ�,�O���[���q���Y�ÎR���[�W�����Z���^�[(��c),708-0806,�ÎR�s��c920,35.092487,134.002691,0868-27-7150,,https://www.city.tsuyama.lg.jp/city/index2.php?id=641,�c�����,,0868-32-2140,2303,,,,,,,
���J(�z�[���y�[�W�ɕ\������),���̑�,2023�N10��14��,10:00,19:00,���b�c�`�������W�N�b�L���O�I��i�W��,�ÎR�s�n��𗬃Z���^�[(�A���l�E�ÎR4�K),708-0065,�ÎR�s�V����17,35.05888,134.000566,0868-31-2010,,,�ی����H��,,0868-32-2117,,,,,,,,
���J(�z�[���y�[�W�ɕ\������),�Ղ�E�C�x���g,2023�N10��15��,,,�ÎR�܂�(����_��),����_��(��V��),,,,,,,,�ÎR�܂���s�ψ������(�ÎR���H��c����),,0868-22-3141,,,,,,,,
���J(�z�[���y�[�W�ɕ\������),�Ղ�E�C�x���g,2023�N10��15��,,,B3���[�O������u�g���C�t�[�v���Rvs����u���[�E�B���Y�v,�ÎR�����̈��(�R�k),708-0004,�ÎR�s�R�k669,35.068894,134.008458,0868-24-0202,,,�g���C�t�[�v���R,,086-230-3886,,,,,,,,
���J(�z�[���y�[�W�ɕ\������),�Ղ�E�C�x���g,2023�N10��15��,,,�ÎR�܂Ȃт̓S���ف`�򌴂ӂꂠ���z�R�����u���g�������[�o�X2023-���R�L��S�������ٍ�-�v,�ÎR�܂Ȃт̓S���فi��J�j�ق�,,,,,,,,�ό��U����,�v��,0868-32-2082,3312,,,,,,,
���J(�z�[���y�[�W�ɕ\������),�Ղ�E�C�x���g,2023�N10��15��,8:00,9:00,���΂̒��s,���Β��C���t�H���[�V�����Z���^�[���ԏ�(���Β��K��),,,,,,,,�ÎR�s�ό�����k�x��,,0868-42-4402,,,,,,,,
���J(�z�[���y�[�W�ɕ\������),�Ղ�E�C�x���g,2023�N10��15��,10:00,11:00,�S���A���Ճv���C�x���g,�v�ĎR���b�W(�_��)�W��,,,,,,,,NPO�@�l�`���̋�,,0868-57-2143,,,,,,,,
���J(�z�[���y�[�W�ɕ\������),���̑�,2023�N10��15��,10:00,14:30,�ӂꂠ����,�s�����������ԏ�,,,,,,,,�ӂꂠ���X�|�[�c�����s�ψ������,,0868-23-0518,,,"
&nbsp;",,,,,
���J(�z�[���y�[�W�ɕ\������),���̑�,2023�N10��15��,10:00,19:00,���b�c�`�������W�N�b�L���O�I��i�W��,�ÎR�s�n��𗬃Z���^�[(�A���l�E�ÎR4�K),708-0065,�ÎR�s�V����17,35.05888,134.000566,0868-31-2010,,,�ی����H��,,0868-32-2117,,,,,,,,
���J(�z�[���y�[�W�ɕ\������),�Ղ�E�C�x���g,2023�N10��15��,13:00,,2023�v���i�X�Ȃł������[�O�u���R����Belle vs �m���f�B�[�A�k�C���v,�ÎR���㋣�Z��(�u�˕�),708-0825,�ÎR�s�u�˕�245,35.082326,134.018182,0868-24-3773,,,���R����Belle������,,0868-72-2004,,https://www.yunogo-belle.com/,,,,,,
���J(�z�[���y�[�W�ɕ\������),�Ղ�E�C�x���g,2023�N10��15��,14:00,15:30,�j�������Q��s�����u���uWeb�Ŏd����������Ăǂ�Ȃ��ƁH�v,�ÎR�j�������Q��Z���^�[�u����E����v(�A���l�E�ÎR5�K),708-8520,�ÎR�s�V����17�@�A���l�E�ÎR5�K,35.05893,134.000516,0868-31-2533,,https://www.city.tsuyama.lg.jp/life/index2.php?id=2051,�ÎR�j�������Q��Z���^�[�u����E����v,,0868-31-2533,,,,,,,,
���J(�z�[���y�[�W�ɕ\������),���N�E����,2023�N10��16��,10:00,11:30,�玙���N���k,�ÎR�����₩�E���ǂ��Z���^�[(�R�k),708-0004,�ÎR�s�R�k800,35.069076,134.009127,0868-32-2179,,,���N���i��,,0868-32-2069,,https://www.city.tsuyama.lg.jp/life/index2.php?id=8173,,,,,,
���J(�z�[���y�[�W�ɕ\������),���k,2023�N10��16��,13:00,15:00,�s�����k,���Β������Z���^�[(���Β�������),,,,,,,,���Ύx���n��U����,,0868-32-7032,,,,,,,,
���J(�z�[���y�[�W�ɕ\������),���k,2023�N10��17��,9:00,11:00,�ߎR�m���瑊�k,���瑊�k�Z���^�[�u�ߎR�m�v(���c��),,,,,,,,�ߎR�m,,0868-22-2523,,,,,,,,
���J(�z�[���y�[�W�ɕ\������),���N�E����,2023�N10��17��,12:50,13:30,3�Ύ����f,�ÎR�����₩�E���ǂ��Z���^�[(�R�k),708-0004,�ÎR�s�R�k800,35.069076,134.009127,0868-32-2179,,,���N���i��,,0868-32-2069,,https://www.city.tsuyama.lg.jp/life/index2.php?id=8226,,,,,,
���J(�z�[���y�[�W�ɕ\������),���k,2023�N10��18��,10:00,15:00,�s�����k,���Β�������(���Β�����),709-3905,�ÎR�s���Β�����104,35.178164,134.054532,0868-42-3035,,,���Ύx���n��U����,,0868-32-7032,,,,,,,,
���J(�z�[���y�[�W�ɕ\������),���̑�,2023�N10��18��,10:30,12:00,�ÎR�t�@�~���[�E�T�|�[�g�Z���^�[�u�K��u�w�q�ǂ��̐��b�x�Ɓw�q�ǂ��̗V�сx�v,�ÎR�j�������Q��Z���^�[�u����E����v(�A���l�E�ÎR5�K),708-8520,�ÎR�s�V����17�@�A���l�E�ÎR5�K,35.05893,134.000516,0868-31-2533,,https://www.city.tsuyama.lg.jp/life/index2.php?id=2051,�ÎR�t�@�~���[�E�T�|�[�g�E�Z���^�[,,0868-31-8753,,,,,,,,
���J(�z�[���y�[�W�ɕ\������),���N�E����,2023�N10��18��,12:50,13:30,3�Ύ����f,�ÎR�����₩�E���ǂ��Z���^�[(�R�k),708-0004,�ÎR�s�R�k800,35.069076,134.009127,0868-32-2179,,,���N���i��,,0868-32-2069,,https://www.city.tsuyama.lg.jp/life/index2.php?id=8226,,,,,,
���J(�z�[���y�[�W�ɕ\������),���k,2023�N10��19��,9:00,12:00,�l���E�����������k,���k�ی������Z���^�[(�V�쓌),,,,,,,,���k�x���n��U����,,0868-32-7023,,,,,,,,
���J(�z�[���y�[�W�ɕ\������),���̑�,2023�N10��19��,10:00,11:00,�ÎR�s��v�ҒǓ���,�ÎR�����̈��(�R�k),708-0004,�ÎR�s�R�k669,35.068894,134.008458,0868-24-0202,,,����������,,0868-32-2063,,,,,,,,
���J(�z�[���y�[�W�ɕ\������),�Ղ�E�C�x���g,2023�N10��19��,10:00,12:00,��l�̂܂Ȃт��u���u�΂����K�u���v*���ߐ؂�8��31��,�ÎR��������(���),,,,,,,,���U�w�K��,,0868-32-2118,,https://www.city.tsuyama.lg.jp/city/index2.php?id=9542,,,,,,
���J(�z�[���y�[�W�ɕ\������),���N�E����,2023�N10��19��,13:30,16:00,�D�w���Ȍ��f*�\��v,�ÎR���Ȉ�ÃZ���^�[�f�Ï��i���j,,,,,,,,���N���i��,,0868-32-2069,,,,,,,,
���J(�z�[���y�[�W�ɕ\������),���k,2023�N10��19��,13:30,16:30,�ߎR�m���瑊�k,���瑊�k�Z���^�[�u�ߎR�m�v(���c��),,,,,,,,�ߎR�m,,0868-22-2523,,,,,,,,
���J(�z�[���y�[�W�ɕ\������),���N�E����,2023�N10��19��,14:00,15:30,��삨�������u���u�ݑ�ł̉��Z�p�v,���Β������Z���^�[(���Β�������),709-3906,�ÎR�s���Β�������143,35.17871444,134.0500792,0868-42-3311,,,�ÎR�s�n���x���Z���^�[,,0868-23-1004,,,,,,,,
���J(�z�[���y�[�W�ɕ\������),���k,2023�N10��20��,9:00,12:00,�s���E�����������k,�v�Ďx��(���k��),,,,,,,,�v�Ďx���n��U����,,0868-32-7011,,,,,,,,
���J(�z�[���y�[�W�ɕ\������),���k,2023�N10��20��,10:00,15:00,����������k��*�\���v,�ÎR�s����2�K���c��(�R�k),708-8501,�ÎR�s�R�k520,35.069591,134.004579,0868-32-2021,,https://www.city.tsuyama.lg.jp/,���R�s���Ď��s�����k�Z���^�[,,086-231-4321,,,,,,,,
���J(�z�[���y�[�W�ɕ\������),���N�E����,2023�N10��20��,12:50,13:30,3�Ύ����f,�ÎR�����₩�E���ǂ��Z���^�[(�R�k),708-0004,�ÎR�s�R�k800,35.069076,134.009127,0868-32-2179,,,���N���i��,,0868-32-2069,,https://www.city.tsuyama.lg.jp/life/index2.php?id=8226,,,,,,
���J(�z�[���y�[�W�ɕ\������),���k,2023�N10��20��,15:00,17:00,�ߎR�m���瑊�k,���瑊�k�Z���^�[�u�ߎR�m�v(���c��),,,,,,,,�ߎR�m,,0868-22-2523,,,,,,,,
���J(�z�[���y�[�W�ɕ\������),�Ղ�E�C�x���g,2023�N10��21��,,,B3���[�O������u�g���C�t�[�v���Rvs�򕌃X�D�[�v�X�v,�ÎR�����̈��(�R�k),708-0004,�ÎR�s�R�k669,35.068894,134.008458,0868-24-0202,,,�g���C�t�[�v���R,,086-230-3886,,,,,,,,
���J(�z�[���y�[�W�ɕ\������),���̑�,2023�N10��21��,,,�s���㌩�l�{���u��*���ߐ؂�9��22��,�ÎR�s�����������(�R�k),708-0004,�ÎR�s�R�k520,35.069357,134.00537,0868-23-5130,,,�ÎR�s�Љ�����c�� �ÎR�s�����i��Z���^�[�u�炢�Ƃ���v,,0868-23-7978,,,,,,,,
���J(�z�[���y�[�W�ɕ\������),��,2023�N10��21��,10:00,14:00,���T�C�N���t�F�A2023,�ÎR����N���[���Z���^�[���T�C�N���v���U(�̉�),,,,,,,,�ÎR���掑���z�{�ݑg��,����,0868-57-2221,,,,,,,,
���J(�z�[���y�[�W�ɕ\������),�Ղ�E�C�x���g,2023�N10��21��,12:30,16:00,�c�F�̕��� �L��q�ǂ��̕���,�c�F�����_��(�c�F),,,,,,,,�L�������,,0868-29-0380,,,,,,,,
���J(�z�[���y�[�W�ɕ\������),���̑�,2023�N10��21��,14:00,16:30,�Ǔ��V���|�W�E���u�ÎR�����񂾁A���{�̗��j�w�� �R�{�����搶�v,�ÎR�ߎR�z�e��(���V��),708-0832,�ÎR�s���V��114-4,35.063306,134.01999,0868-25-2121,,http://www.kakuzan-hotel.co.jp/,�ÎR���y������,,0868-22-4567,,,,,,,,
���J(�z�[���y�[�W�ɕ\������),�Ղ�E�C�x���g,2023�N10��22��,,,�ÎR�܂�(����_��),����_��(�{�e��),,,,,,,,�ÎR�܂���s�ψ������(�ÎR���H��c����),,0868-22-3141,,,,,,,,
���J(�z�[���y�[�W�ɕ\������),�Ղ�E�C�x���g,2023�N10��22��,,,�ÎR�܂�(����_��),����_��(��{),,,,,,,,�ÎR�܂���s�ψ������(�ÎR���H��c����),,0868-22-3141,,,,,,,,
���J(�z�[���y�[�W�ɕ\������),�Ղ�E�C�x���g,2023�N10��22��,,,B3���[�O������u�g���C�t�[�v���Rvs�򕌃X�D�[�v�X�v,�ÎR�����̈��(�R�k),708-0004,�ÎR�s�R�k669,35.068894,134.008458,0868-24-0202,,,�g���C�t�[�v���R,,086-230-3886,,,,,,,,
���J(�z�[���y�[�W�ɕ\������),���̑�,2023�N10��22��,9:00,12:00,�ÎR�s����B��G�C�m�Z���^�[�̈�ك��j���[�A���L�O���p���i���Ɓu���䌒�O�u����E�̑������v,���Β��X�|�[�c�Z���^�[(���Β�����),709-3931,�ÎR�s���Β�����493-3,35.176091,134.046428,0868-42-3358,,,���Ύx���n��U����,�q��,0868-42-3358,,,,,,,,
���J(�z�[���y�[�W�ɕ\������),�Ղ�E�C�x���g,2023�N10��22��,13:30,15:30,�ÎR�܂��Ȃ��J���b�W�u�e�q�ō�낤�I�X�[�p�[���q�R�[�L�����v,�ÎR�H�ƍ������w�Z(��),,,,,,,,�݂炢�Y�Ɖ�,���R�C�͌�,0868-24-0740,3154,,,,,,,
���J(�z�[���y�[�W�ɕ\������),���̑�,2023�N10��22��,13:30,15:30,�����x���ҁE�e�����Z�~�i�[*�\������10��16���܂�,�s���}����(�A���l�E�ÎR4�K),708-0065,�ÎR�s�V����17,35.05893,134.000516,0868-24-2919,,https://tsuyamalib.tvt.ne.jp/,�d���E�ڏZ�x����,�勴,0868-24-3633,3818,,,,,,,
���J(�z�[���y�[�W�ɕ\������),�Ղ�E�C�x���g,2023�N10��22��,14:00,,�����_�Ђ̉ԍՂ�,�����_�Ёi���Β������j,,,,,,,,���Ύx���n��U����,,0868-32-7035,,,,,,,,
���J(�z�[���y�[�W�ɕ\������),���N�E����,2023�N10��23��,8:30,17:15,��ƌ��N�̏T�ԃp�l���W*10��27���܂�,�ÎR�s�����P�K�s�����r�[(�R�k),708-8501,�ÎR�s�R�k520,35.069591,134.004579,0868-32-2021,,,��Õی���,,0868-32-2071,,,,,,,,
���J(�z�[���y�[�W�ɕ\������),���N�E����,2023�N10��23��,10:00,11:30,�玙���N���k,�ÎR�����₩�E���ǂ��Z���^�[(�R�k),708-0004,�ÎR�s�R�k800,35.069076,134.009127,0868-32-2179,,,���N���i��,,0868-32-2069,,https://www.city.tsuyama.lg.jp/life/index2.php?id=8173,,,,,,
���J(�z�[���y�[�W�ɕ\������),���k,2023�N10��23��,10:00,16:00,�s���Y�������k��,�ÎR�s����2�K���c��(�R�k),708-8501,�ÎR�s�R�k520,35.069591,134.004579,0868-32-2021,,https://www.city.tsuyama.lg.jp/,�ېŉ�,,0868-32-2016,,,,,,,,
���J(�z�[���y�[�W�ɕ\������),�Ղ�E�C�x���g,2023�N10��23��,18:00,20:30,�ÎR����Z�p�𗬃v���U�E�ÎR���H��c�������Y�w�A�g�𗬉�,�U�E�V�����}�e���X�ÎR�ʓ@(�R��),708-0022,�ÎR�s�R��30-1,35.06108988,134.0028335,0868-24-2111,,https://www.tsuyama-bettei.com/,��܎Y�Ǝx���Z���^�[,�͌��A�F��,0868-24-0740,3155,,,,,,,
���J(�z�[���y�[�W�ɕ\������),���̑�,2023�N10��24��,10:00,11:30,�͂��߂Ċw�Ԗ򑐍u��*���ߐ؂�10��16��,����������(��J),708-0882,�ÎR�s��J600,35.052255,133.993536,0868-24-5111,,,����������,,0868-24-5111,,,,,,,,
���J(�z�[���y�[�W�ɕ\������),���̑�,2023�N10��25��,13:30,15:00,���N�Â���u���u�F�m�ǂ������ƒm�낤�v*�\������10��16���܂�,����������(��J),708-0882,�ÎR�s��J600,35.052255,133.993536,0868-24-5111,,,����������,,0868-24-5111,,,,,,,,
���J(�z�[���y�[�W�ɕ\������),���N�E����,2023�N10��25��,13:30,15:00,�͂��ҁ[�q��ċ���,�ÎR�����₩�E���ǂ��Z���^�[(�R�k),708-0004,�ÎR�s�R�k800,35.069076,134.009127,0868-32-2179,,,���N���i��,,0868-32-2069,,https://www.city.tsuyama.lg.jp/life/index2.php?id=8227,,,,,,
���J(�z�[���y�[�W�ɕ\������),���k,2023�N10��25��,13:30,15:30,�i�@���m�@�����k*�����E�\��v,�ÎR�s����1�K��������(�R�k),,,,,,,,��������,,0868-32-2057,,,,,,,,
���J(�z�[���y�[�W�ɕ\������),���̑�,2023�N10��25��,15:30,16:30,�ӂꂠ���f�[ ���ؐ��ߑ̌�,���g������(���g),709-3951,�ÎR�s���g1782-1,35.238218,134.112201,0868-46-2076,,,���g������,,0868-46-2076,,,,,,,,
���J(�z�[���y�[�W�ɕ\������),���k,2023�N10��26��,10:00,12:00,�ߎR�m���瑊�k,���瑊�k�Z���^�[�u�ߎR�m�v(���c��),,,,,,,,�ߎR�m,,0868-22-2523,,,,,,,,
���J(�z�[���y�[�W�ɕ\������),���k,2023�N10��26��,13:30,16:30,�Z������k,�ÎR�s�����P�K�s�����r�[(�R�k),708-8501,�ÎR�s�R�k520,35.069591,134.004579,0868-32-2021,,,�s�s�v���,,0868-32-2099,,,,,,,,
���J(�z�[���y�[�W�ɕ\������),�Ղ�E�C�x���g,2023�N10��26��,14:00,16:00,��l�̎Љ�w��2�e�u�����F�X�}�z�h�Ѝu���ƃA���l�E�ÎR�h�Аݔ��ҁv*���ߐ؂�9��22��,�ÎR�j�������Q��Z���^�[�u����E����v(�A���l�E�ÎR5�K),708-8520,�ÎR�s�V����17�@�A���l�E�ÎR5�K,35.05893,134.000516,0868-31-2533,,https://www.city.tsuyama.lg.jp/life/index2.php?id=2051,���U�w�K��,,0868-32-2118,,https://www.city.tsuyama.lg.jp/city/index2.php?id=9605,,,,,,
���J(�z�[���y�[�W�ɕ\������),�Ղ�E�C�x���g,2023�N10��27��,9:30,18:00,�킽���̒��̂�������� �G��W*10��31���܂�,����⑍�{��2�K�A�[�g�z�[��(��),,,,,,,,�w�Z�����,,0868-32-2114,,,,,,,,
���J(�z�[���y�[�W�ɕ\������),���N�E����,2023�N10��27��,10:00,15:30,�������(10������11��15���܂ŁC12��30������15��30���܂�),�ÎR�s�����P�K�s�����r�[(�R�k),708-8501,�ÎR�s�R�k520,35.069591,134.004579,0868-32-2021,,,���N���i��,,0868-32-2069,,,,,,,,
���J(�z�[���y�[�W�ɕ\������),���̑�,2023�N10��28��,9:00,,�ÎR�s��v�N�x�C�p�E���̗p�����i�ۈ珊�E�F�肱�ǂ����E�c�t���j,�ÎR�����₩�E���ǂ��Z���^�[(�R�k),708-0004,�ÎR�s�R�k800,35.069076,134.009127,0868-32-2179,,,���ǂ��ۈ��,�����C�����C����,0868-32-7028,3634,,,,,,,
���J(�z�[���y�[�W�ɕ\������),�Ղ�E�C�x���g,2023�N10��28��,10:00,21:00,��܏铌�܂�����2023�H�E�A�[�g���N���t�g�W�{����a���̂�����W*10��29��15���܂�,�铌�n��E�o�_�X�������̊ό��{�݁C�X�܁C���ƂȂ�34�J��(�\��),,,,,,,,��܏铌�܂����B������,,0868-22-8845�A090-8241-9373(���c����),,,,,,,,
���J(�z�[���y�[�W�ɕ\������),���j,2023�N10��28��,13:30,15:00,����w�u���u���ÎR�ˎm�������̖����ېV�v*���ߐ؂�10��13��,�����w(�k����),708-8511,�ÎR�s�k����50�Ԓn,35.076584,134.007926,0868-22-7718,,,���U�w�K��,,0868-32-2118,,https://www.city.tsuyama.lg.jp/city/index2.php?id=9659,,,,,,
���J(�z�[���y�[�W�ɕ\������),�Ղ�E�C�x���g,2023�N10��28��,13:30,16:00,�ÎR������j�g���b�v���܂ނ���,�s���}����(�A���l�E�ÎR4�K),708-0065,�ÎR�s�V����17,35.05893,134.000516,0868-24-2919,,https://tsuyamalib.tvt.ne.jp/,�s���}����,�e��,0868-24-2919,2781,,,,,,,
���J(�z�[���y�[�W�ɕ\������),�Ղ�E�C�x���g,2023�N10��29��,9:00,15:00,�ӂꂠ���L�� �v�Ăӂ邳�Ƃ܂�,�v�đ��������^�������O���E���h�E�v�Č�����(���k��),,,,,,,,�v�Ďx���n��U����,,0868-32-7011,,,,,,,,
���J(�z�[���y�[�W�ɕ\������),�Ղ�E�C�x���g,2023�N10��29��,10:30,15:30,�ÎR�܂��Ȃ��J���b�W6���N�L�O�C�x���g,�ÎR�܂��Ȃ��J���b�W(�ÎR�s�n��𗬃Z���^�[��:�A���l�E�ÎR4�K),,,,,,,,�ÎR�܂��Ȃ��J���b�W������,,0868-31-2232,,,,,,,,
���J(�z�[���y�[�W�ɕ\������),�Ղ�E�C�x���g,2023�N10��29��,13:30,15:00,������w���R�w�K�Z���^�[�A�g�u���u�j���g���͂Ȃ����������Y�ނ̂��v,�s���}����(�A���l�E�ÎR4�K),708-0065,�ÎR�s�V����17,35.05893,134.000516,0868-24-2919,,https://tsuyamalib.tvt.ne.jp/,�s���}����,,0868-24-2919,,,,,,,,
���J(�z�[���y�[�W�ɕ\������),���N�E����,2023�N10��30��,10:00,11:30,�玙���N���k,�ÎR�����₩�E���ǂ��Z���^�[(�R�k),708-0004,�ÎR�s�R�k800,35.069076,134.009127,0868-32-2179,,,���N���i��,,0868-32-2069,,https://www.city.tsuyama.lg.jp/life/index2.php?id=8173,,,,,,
���J(�z�[���y�[�W�ɕ\������),�Ղ�E�C�x���g,2023�N10��31��,,,�H�̏鉺�C�x���g*11��5���܂�,�鉺�G���A,,,,,,,,���ƁE��ʐ����,,0868-32-2081,,,,,,,,
���J(�z�[���y�[�W�ɕ\������),���N�E����,2023�N10��31��,14:00,15:00,�����H����*�\��v,�ÎR�����₩�E���ǂ��Z���^�[(�R�k),708-0004,�ÎR�s�R�k800,35.069076,134.009127,0868-32-2179,,,���N���i��,,0868-32-2069,,https://www.city.tsuyama.lg.jp/life/index2.php?id=8164,,,,,,
